تطبيقات

Flutter build APK Android Studio | Flutter Dart Tutorials



Flutter Dart tutorials
Hello! Flutter Dart tutorials series.
today we will cover flutter apk for Android and in very easy step
create keystore
build apk many other things

this line
“D:Keystore” changing according to you

keytool -genkey -v -keystore D:Keystorekey.jks -keyalg RSA -keysize 2048 -validity 10000 -alias key

this is our ongoing series on flutter dart tutorials for beginners to advance . everyone learn it from basic to advance
flutter power by google and dart programming language also powerby google

Learn Flutter Plugins for Everyone.
http://bit.ly/2MvnLRU
Join us
Facebook
https://web.facebook.com/ParhoLikhoComputerScience/
instagram
https://www.instagram.com/parholikhocs/
twitter

join also our developer’s groups
https://web.facebook.com/groups/462544377493626/

#FlutterAPK #Flutter #FlutterWeb
keywords
flutter tutorials , Flutter UI . Flutter dart lang , dart programming language ,
apk

السابق
أفخم 4 تطبيقات جديدة للأندرويد | خاصة التطبيق الأول خرافي
التالي
نقل حافلات سجن الشرطة – ألعاب حافلات الشرطة – محاكي القيادة – العاب سيارات – ألعاب أندرويد

19 تعليق

أضف تعليقا

  1. Thank you very much. great tutorial

  2. Hello bro * which file will need upload in App store APK or .aab*

  3. Bhai hindi m bolta to jyada samajh aata.

  4. Vu Do قال:

    thank you so much, it very helpfull for me

  5. Amjed Ali قال:

    thank you so much

  6. I dont understand a single word

  7. 로어단 قال:

    "def keystoreProperties = new Properties()

    def keystorePropertiesFile = rootProject.file('key.properties')

    if (keystorePropertiesFile.exists()) {

    keystoreProperties.load(new FileInputStream(keystorePropertiesFile))
    "
    It sids It can't resolve symbol Properties and FileinputStream and It failed to build apk file. how can i fix it?

  8. Quoc Pham قال:

    thanks bro.

  9. Key tool is not recognised internal and external, this problem is getting to me, could you please make a video on it

  10. Hi, great video, I get this error when I run "flutter build apk", can you help me please
    * What went wrong:

    A problem occurred evaluating project ':app'.

    > path may not be null or empty string. path='null'

    * Try:

    Run with –stacktrace option to get the stack trace. Run with –info or –debug option to get more

    log output. Run with –scan to get full insights.

    * Get more help at https://help.gradle.org

    BUILD FAILED in 2s

    Running Gradle task 'assembleRelease'…

    Running Gradle task 'assembleRelease'… Done 3,0s

    Gradle task assembleRelease failed with exit code 1

  11. This video really helps, I really appreciate it!
    Thank you 🙂 and keep up!

  12. Thank you Thank you Thank you Thank you Thank you Thank you Thank you Thank you Thank you Thank you Thank you Thank you Thank you Thank you Thank you Thank you Thank you Thank you Thank you Thank you Thank you Thank you Thank you Thank you Thank you Thank you Thank you Thank you Thank you Thank you Thank you Thank you Thank you Thank you Thank you Thank you Thank you Thank you Thank you Thank you Thank you Thank you Thank you Thank you Thank you Thank you Thank you Thank you Thank you Thank you Thank you Thank you Thank you Thank you Thank you Thank you Thank you Thank you Thank you Thank you Thank you Thank you Thank you Thank you Thank you Thank you Thank you Thank you Thank you Thank you Thank you Thank you Thank you Thank you Thank you Thank you Thank you Thank you Thank you Thank you Thank you Thank you Thank you Thank you Thank you Thank you Thank you Thank you Thank you Thank you Thank you Thank you Thank you Thank you Thank you Thank you Thank you Thank you Thank you Thank you Thank you Thank you Thank you Thank you Thank you Thank you Thank you Thank you Thank you Thank you Thank you Thank you Thank you Thank you Thank you Thank you Thank you Thank you Thank you Thank you Thank you Thank you Thank you Thank you Thank you Thank you Thank you Thank you Thank you Thank you Thank you Thank you Thank you Thank you Thank you Thank you Thank you Thank you Thank you Thank you Thank you Thank you Thank you Thank you Thank you Thank you Thank you Thank you Thank you Thank you Thank you Thank you Thank you Thank you Thank you Thank you Thank you Thank you Thank you Thank you Thank you Thank you Thank you Thank you Thank you Thank you Thank you Thank you Thank you Thank you Thank you Thank you Thank you Thank you Thank you Thank you Thank you Thank you Thank you Thank you Thank you Thank you Thank you Thank you Thank you Thank you Thank you Thank you Thank you Thank you Thank you Thank you Thank you Thank you Thank you Thank you Thank you Thank you Thank you Thank you Thank you Thank you Thank you Thank you Thank you Thank you Thank you Thank you Thank you Thank you Thank you Thank you Thank you Thank you Thank you Thank you Thank you Thank you Thank you Thank you Thank you Thank you Thank you Thank you Thank you Thank you Thank you Thank you Thank you Thank you Thank you Thank you Thank you Thank you Thank you Thank you Thank you Thank you Thank you Thank you

  13. if we update any dart file
    we need to repeat all the process again! or just flutter build apk?

  14. Suna Arun قال:

    Thanks for your great effort , Thanks a lot

  15. when build apk that time gives this error, any solution for that

    Error : Gradle task assembleRelease failed with exit code 1

  16. Hey I'm your subscriber I have fluter app that apk it's not show results after put value can you fix it?

  17. Enrico P. قال:

    Hey cool video, I get this error when I run "flutter build apk"
    * Error running Gradle:
    ProcessException: Process "/Users/USERNAME/AndroidStudioProjects/Flutter_Blanko/android/gradlew" exited abnormally:
    Starting a Gradle Daemon (subsequent builds will be faster)

    FAILURE: Build failed with an exception.

    * Where:
    Build file '/Users/USERNAME/AndroidStudioProjects/Flutter_Blanko/android/app/build.gradle' line: 53

اترك تعليقاً